Seite 1 von 1

installationsscript fehler

Verfasst: 24.05.2006, 18:01
von J-M-F
hallo will den player mal auf suse 10.1 probieren, aber er bricht immer bei den modulen ab.

gtk+, gcc und kernel sorcen sind drin. suchen brachte mir keine hilfe, vielleicht weiss wer rat? thx

Building the vmmon module.

Using 2.6.x kernel build system.
make: Entering directory `/tmp/vmware-config1/vmmon-only'
make -C /lib/modules/2.6.16.13-4-smp/build/include/.. SUBDIRS=$PWD SRCROOT=$PWD/
. modules
make[1]: Entering directory `/usr/src/linux-2.6.16.13-4-obj/x86_64/smp'
make -C ../../../linux-2.6.16.13-4 O=../linux-2.6.16.13-4-obj/x86_64/smp modules
CC [M] /tmp/vmware-config1/vmmon-only/linux/driver.o
In file included from /tmp/vmware-config1/vmmon-only/linux/driver.h:20,
from /tmp/vmware-config1/vmmon-only/linux/driver.c:49:
/tmp/vmware-config1/vmmon-only/./include/compat_wait.h:37:5: warning: "VMW_HAVE_
EPOLL" is not defined
/tmp/vmware-config1/vmmon-only/./include/compat_wait.h:43:5: warning: "VMW_HAVE_
EPOLL" is not defined
In file included from /tmp/vmware-config1/vmmon-only/linux/driver.h:20,
from /tmp/vmware-config1/vmmon-only/linux/driver.c:49:
/tmp/vmware-config1/vmmon-only/./include/compat_wait.h:60: error: conflicting ty
pes for 'poll_initwait'
/usr/src/linux-2.6.16.13-4/include/linux/poll.h:45: error: previous declaration
of 'poll_initwait' was here
/tmp/vmware-config1/vmmon-only/linux/driver.c:145: warning: initialization from
incompatible pointer type
/tmp/vmware-config1/vmmon-only/linux/driver.c:149: warning: initialization from
incompatible pointer type
/tmp/vmware-config1/vmmon-only/linux/driver.c: In function 'LinuxDriverNoPage':
/tmp/vmware-config1/vmmon-only/linux/driver.c:1013: error: 'mem_map' undeclared
(first use in this function)
/tmp/vmware-config1/vmmon-only/linux/driver.c:1013: error: (Each undeclared iden
tifier is reported only once
/tmp/vmware-config1/vmmon-only/linux/driver.c:1013: error: for each function it
appears in.)
/tmp/vmware-config1/vmmon-only/linux/driver.c: In function 'LinuxDriverLockedNoP
age':
/tmp/vmware-config1/vmmon-only/linux/driver.c:1083: error: 'mem_map' undeclared (first use in this function)
/tmp/vmware-config1/vmmon-only/linux/driver.c: In function 'LinuxDriverNoPage':
/tmp/vmware-config1/vmmon-only/linux/driver.c:1022: warning: control reaches end of non-void function
make[4]: *** [/tmp/vmware-config1/vmmon-only/linux/driver.o] Error 1
make[3]: *** [_module_/tmp/vmware-config1/vmmon-only] Error 2
make[2]: *** [modules] Error 2
make[1]: *** [modules] Error 2
make[1]: Leaving directory `/usr/src/linux-2.6.16.13-4-obj/x86_64/smp'
make: *** [vmmon.ko] Error 2
make: Leaving directory `/tmp/vmware-config1/vmmon-only'
Unable to build the vmmon module.

Verfasst: 24.05.2006, 18:32
von continuum
any2any-patch probiert?

Verfasst: 24.05.2006, 21:44
von J-M-F
nee habe nicht gesehen das die 100 net der aktuelle patch war. mit der 101 geht es